Reaction Details
TargetKappa-type opioid receptor
LigandBDBM50147748
Substrate/Competitorn/a
Meas. Tech.ChEMBL_145241 (CHEMBL755692)
Ki 74±n/a nM
Citation Zaveri, NTJiang, FOlsen, CMDeschamps, JRParrish, DPolgar, WToll, L A novel series of piperidin-4-yl-1,3-dihydroindol-2-ones as agonist and antagonist ligands at the nociceptin receptor. J Med Chem47:2973-6 (2004) 
 
Kappa-type opioid receptor
Name:Kappa-type opioid receptor
Type:G Protein-Coupled Receptor (GPCR)
Mol. Mass.:42648.76
Organism:Homo sapiens (Human)
Description:P41145
Residue:380
BDBM50147748
NameBDBM50147748
Synonyms:1-{1-[1-(9H-Fluoren-2-yl)-ethyl]-piperidin-4-yl}-1,3-dihydro-indol-2-one | CHEMBL328411
TypeSmall organic molecule
Emp. Form.C28H28N2O
Mol. Mass.408.5347
SMILESCC(N1CCC(CC1)N1C(=O)Cc2ccccc12)c1ccc-2c(Cc3ccccc-23)c1