Reaction Details
TargetAdenosine receptor A1
LigandBDBM50090695
Substrate/Competitorn/a
Meas. Tech.ChEMBL_29102 (CHEMBL638714)
Ki>10000±n/a nM
Citation Ferrarini, PLBetti, LCavallini, TGiannaccini, GLucacchini, AManera, CMartinelli, AOrtore, GSaccomanni, GTuccinardi, T Study on affinity profile toward native human and bovine adenosine receptors of a series of 1,8-naphthyridine derivatives. J Med Chem47:3019-31 (2004) 
 
Adenosine receptor A1
Name:Adenosine receptor A1
Type:Enzyme Catalytic Domain
Mol. Mass.:36602.99
Organism:BOVINE
Description:ADENOSINE 0 BOVINE::P28190
Residue:326
BDBM50090695
NameBDBM50090695
Synonyms:7-Phenyl-[1,8]naphthyridine-2,5-diol | CHEMBL97904
TypeSmall organic molecule
Emp. Form.C14H10N2O2
Mol. Mass.238.2414
SMILESOc1cc(nc2[nH]c(=O)ccc12)-c1ccccc1