Reaction Details
TargetAdenosine receptor A1
LigandBDBM50147869
Substrate/Competitorn/a
Meas. Tech.ChEMBL_27451 (CHEMBL641817)
Ki 1460±n/a nM
Citation Ferrarini, PLBetti, LCavallini, TGiannaccini, GLucacchini, AManera, CMartinelli, AOrtore, GSaccomanni, GTuccinardi, T Study on affinity profile toward native human and bovine adenosine receptors of a series of 1,8-naphthyridine derivatives. J Med Chem47:3019-31 (2004) 
 
Adenosine receptor A1
Name:Adenosine receptor A1
Type:G Protein-Coupled Receptor (GPCR)
Mol. Mass.:36520.92
Organism:Homo sapiens (Human)
Description:P30542
Residue:326
BDBM50147869
NameBDBM50147869
Synonyms:CHEMBL104998 | N-[4-(4-Hydroxy-7-methyl-[1,8]naphthyridin-2-yl)-phenyl]-acetamide
TypeSmall organic molecule
Emp. Form.C17H15N3O2
Mol. Mass.293.3199
SMILESCC(=O)Nc1ccc(cc1)-c1cc(O)c2ccc(C)nc2n1