Reaction Details
TargetAdenosine receptor A2a
LigandBDBM50090697
Substrate/Competitorn/a
Meas. Tech.ChEMBL_27616 (CHEMBL639492)
Ki 100±n/a nM
Citation Ferrarini, PLBetti, LCavallini, TGiannaccini, GLucacchini, AManera, CMartinelli, AOrtore, GSaccomanni, GTuccinardi, T Study on affinity profile toward native human and bovine adenosine receptors of a series of 1,8-naphthyridine derivatives. J Med Chem47:3019-31 (2004) 
 
Adenosine receptor A2a
Name:Adenosine receptor A2a
Type:G Protein-Coupled Receptor (GPCR)
Mol. Mass.:44716.46
Organism:Homo sapiens (Human)
Description:P29274
Residue:412
BDBM50090697
NameBDBM50090697
Synonyms:7-Chloro-2-phenyl-[1,8]naphthyridin-4-ol CHEMBL97760
TypeSmall organic molecule
Emp. Form.C14H9ClN2O
Mol. Mass.256.687
SMILESOc1cc(nc2nc(Cl)ccc12)-c1ccccc1