Reaction Details
TargetAdenosine receptor A2a
LigandBDBM50090684
Substrate/Competitorn/a
Meas. Tech.ChEMBL_27924 (CHEMBL642332)
Ki 490±n/a nM
Citation Ferrarini, PLBetti, LCavallini, TGiannaccini, GLucacchini, AManera, CMartinelli, AOrtore, GSaccomanni, GTuccinardi, T Study on affinity profile toward native human and bovine adenosine receptors of a series of 1,8-naphthyridine derivatives. J Med Chem47:3019-31 (2004) 
 
Adenosine receptor A2a
Name:Adenosine receptor A2a
Type:G Protein-Coupled Receptor (GPCR)
Mol. Mass.:44716.46
Organism:Homo sapiens (Human)
Description:P29274
Residue:412
BDBM50090684
NameBDBM50090684
Synonyms:7-Methoxy-2-phenyl-[1,8]naphthyridin-4-ol CHEMBL329294
TypeSmall organic molecule
Emp. Form.C15H12N2O2
Mol. Mass.252.268
SMILESCOc1ccc2c(O)cc(nc2n1)-c1ccccc1