Reaction Details
TargetAdenosine receptor A2a
LigandBDBM50090695
Substrate/Competitorn/a
Meas. Tech.ChEMBL_27924 (CHEMBL642332)
Ki>10000±n/a nM
Citation Ferrarini, PLBetti, LCavallini, TGiannaccini, GLucacchini, AManera, CMartinelli, AOrtore, GSaccomanni, GTuccinardi, T Study on affinity profile toward native human and bovine adenosine receptors of a series of 1,8-naphthyridine derivatives. J Med Chem47:3019-31 (2004) 
 
Adenosine receptor A2a
Name:Adenosine receptor A2a
Type:G Protein-Coupled Receptor (GPCR)
Mol. Mass.:44716.46
Organism:Homo sapiens (Human)
Description:P29274
Residue:412
BDBM50090695
NameBDBM50090695
Synonyms:7-Phenyl-[1,8]naphthyridine-2,5-diol | CHEMBL97904
TypeSmall organic molecule
Emp. Form.C14H10N2O2
Mol. Mass.238.2414
SMILESOc1cc(nc2[nH]c(=O)ccc12)-c1ccccc1