Reaction Details
TargetSigma non-opioid intracellular receptor 1
LigandBDBM50036738
Substrate/Competitorn/a
Meas. Tech.ChEMBL_2147395 (CHEMBL5031741)
Ki 2.0±n/a nM
Citation Barbaraci, CGiurdanella, GLeotta, CGLongo, AAmata, EDichiara, MPasquinucci, LTurnaturi, RPrezzavento, OCacciatore, IZuccarello, ELupo, GPitari, GMAnfuso, CDMarrazzo, A Haloperidol Metabolite II Valproate Ester ( J Med Chem64:13622-13632 (2021) 
 
Sigma non-opioid intracellular receptor 1
Name:Sigma non-opioid intracellular receptor 1
Type:Protein
Mol. Mass.:25307.17
Organism:Cavia porcellus (Guinea pig)
Description:Q60492
Residue:223
BDBM50036738
NameBDBM50036738
Synonyms:(R)-4-(4-Chloro-phenyl)-1-[4-(4-fluoro-phenyl)-4-hydroxy-butyl]-piperidin-4-ol | CHEMBL129159
TypeSmall organic molecule
Emp. Form.C21H25ClFNO2
Mol. Mass.377.88
SMILESO[C@H](CCCN1CCC(O)(CC1)c1ccc(Cl)cc1)c1ccc(F)cc1