Reaction Details
TargetBeta-secretase 2
LigandBDBM50505569
Substrate/Competitorn/a
Meas. Tech.ChEMBL_2147516 (CHEMBL5031862)
Ki 0.120000±n/a nM
Citation Ueno, TMatsuoka, EAsada, NYamamoto, SKanegawa, NIto, MIto, HMoechars, DRombouts, FJRGijsen, HJMKusakabe, KI Discovery of Extremely Selective Fused Pyridine-Derived ?-Site Amyloid Precursor Protein-Cleaving Enzyme (BACE1) Inhibitors with High In Vivo Efficacy through 10s Loop Interactions. J Med Chem64:14165-14174 (2021) 
 
Beta-secretase 2
Name:Beta-secretase 2
Type:Protein
Mol. Mass.:56171.20
Organism:Homo sapiens (Human)
Description:Q9Y5Z0
Residue:518
BDBM50505569
NameBDBM50505569
Synonyms:CHEMBL4557670
TypeSmall organic molecule
Emp. Form.C18H18F3N5O2S
Mol. Mass.425.428
SMILESC[C@H]1SC(N)=N[C@@](C)([C@H]1F)c1cc(NC(=O)c2cnc(OCF)cn2)ccc1F