Reaction Details
TargetBeta-secretase 2
LigandBDBM50580217
Substrate/Competitorn/a
Meas. Tech.ChEMBL_2147525 (CHEMBL5031871)
Ki 0.290000±n/a nM
Citation Ueno, TMatsuoka, EAsada, NYamamoto, SKanegawa, NIto, MIto, HMoechars, DRombouts, FJRGijsen, HJMKusakabe, KI Discovery of Extremely Selective Fused Pyridine-Derived ?-Site Amyloid Precursor Protein-Cleaving Enzyme (BACE1) Inhibitors with High In Vivo Efficacy through 10s Loop Interactions. J Med Chem64:14165-14174 (2021) 
 
Beta-secretase 2
Name:Beta-secretase 2
Type:Protein
Mol. Mass.:56171.20
Organism:Homo sapiens (Human)
Description:Q9Y5Z0
Residue:518
BDBM50580217
NameBDBM50580217
Synonyms:CHEMBL5093195
TypeSmall organic molecule
Emp. Form.C19H16FN7O2
Mol. Mass.393.3744
SMILESCc1nc(co1)C(=O)Nc1ccc(F)c(c1)[C@]1(C)Cn2nc(cc2C(N)=N1)C#N