Reaction Details
TargetTrypsin
LigandBDBM50149078
Substrate/Competitorn/a
Meas. Tech.ChEMBL_212689 (CHEMBL815474)
IC50>10000±n/a nM
Citation Mederski, WWDorsch, DAnzali, SGleitz, JCezanne, BTsaklakidis, C Halothiophene benzimidazoles as P1 surrogates of inhibitors of blood coagulation factor Xa. Bioorg Med Chem Lett14:3763-9 (2004) 
 
Trypsin
Name:Trypsin
Synonyms:Serine protease 1/Trypsin-2/Trypsin-3
Type:n/a
Mol. Mass.:n/a
Description:ASSAY_ID of ChEMBL is 2155713
Components:This complex has 3 components.
Component 1
Name:Serine protease 1
Type:Enzyme
Mol. Mass.:26557.80
Organism:Homo sapiens (Human)
Description:P07477
Residue:247
Component 2
Name:Trypsin-2
Synonyms:Anionic trypsinogen Serine protease 2 TRY2_HUMAN Thrombin & trypsin Trypsin II | Trypsin-2
Type:PROTEIN
Mol. Mass.:26479.43
Organism:Homo sapiens (Human)
Description:ChEMBL_41517
Residue:247
Component 3
Name:Trypsin-3
Synonyms:Brain trypsinogen PRSS3 Serine protease 3 TRY3 TRY4 Trypsin Trypsin IV | Trypsin-3
Type:PROTEIN
Mol. Mass.:32532.52
Organism:Homo sapiens (Human)
Description:ChEMBL_216043
Residue:304
BDBM50149078
NameBDBM50149078
Synonyms:2-[2-(5-Chloro-thiophen-2-yl)-1H-benzoimidazol-5-yl]-N-[4-(2-oxo-pyrrolidin-1-yl)-phenyl]-acetamide | CHEMBL124846
TypeSmall organic molecule
Emp. Form.C23H19ClN4O2S
Mol. Mass.450.941
SMILESClc1ccc(s1)-c1nc2ccc(CC(=O)Nc3ccc(cc3)N3CCCC3=O)cc2[nH]1