Reaction Details
TargetCoagulation factor X
LigandBDBM50149090
Substrate/Competitorn/a
Meas. Tech.ChEBML_48487
IC50 32±n/a nM
Citation Mederski, WWDorsch, DAnzali, SGleitz, JCezanne, BTsaklakidis, C Halothiophene benzimidazoles as P1 surrogates of inhibitors of blood coagulation factor Xa. Bioorg Med Chem Lett14:3763-9 (2004) 
 
Coagulation factor X
Name:Coagulation factor X
Type:Enzyme
Mol. Mass.:54726.60
Organism:Homo sapiens (Human)
Description:n/a
Residue:488
BDBM50149090
NameBDBM50149090
Synonyms:2-[3-(4-Chloro-phenyl)-ureido]-N-[4-(3-oxo-morpholin-4-yl)-phenyl]-acetamide | CHEMBL125495
TypeSmall organic molecule
Emp. Form.C19H19ClN4O4
Mol. Mass.402.832
SMILESClc1ccc(NC(=O)NCC(=O)Nc2ccc(cc2)N2CCOCC2=O)cc1