Reaction Details
TargetCoagulation factor X
LigandBDBM50149086
Substrate/Competitorn/a
Meas. Tech.ChEBML_48487
IC50 230±n/a nM
Citation Mederski, WWDorsch, DAnzali, SGleitz, JCezanne, BTsaklakidis, C Halothiophene benzimidazoles as P1 surrogates of inhibitors of blood coagulation factor Xa. Bioorg Med Chem Lett14:3763-9 (2004) 
 
Coagulation factor X
Name:Coagulation factor X
Type:Enzyme
Mol. Mass.:54726.60
Organism:Homo sapiens (Human)
Description:n/a
Residue:488
BDBM50149086
NameBDBM50149086
Synonyms:2-[2-(5-Chloro-thiophen-2-yl)-1H-benzoimidazol-5-yl]-N-[4-(3-oxo-morpholin-4-yl)-phenyl]-acetamide | CHEMBL125839
TypeSmall organic molecule
Emp. Form.C23H19ClN4O3S
Mol. Mass.466.94
SMILESClc1ccc(s1)-c1nc2ccc(CC(=O)Nc3ccc(cc3)N3CCOCC3=O)cc2[nH]1