Reaction Details
TargetCoagulation factor X
LigandBDBM50149087
Substrate/Competitorn/a
Meas. Tech.ChEBML_48487
IC50 8.2±n/a nM
Citation Mederski, WWDorsch, DAnzali, SGleitz, JCezanne, BTsaklakidis, C Halothiophene benzimidazoles as P1 surrogates of inhibitors of blood coagulation factor Xa. Bioorg Med Chem Lett14:3763-9 (2004) 
 
Coagulation factor X
Name:Coagulation factor X
Type:Enzyme
Mol. Mass.:54726.60
Organism:Homo sapiens (Human)
Description:n/a
Residue:488
BDBM50149087
NameBDBM50149087
Synonyms:3-[2-(5-Chloro-thiophen-2-yl)-1H-benzoimidazol-5-yl]-N-[3-methyl-4-(3-oxo-morpholin-4-yl)-phenyl]-propionamide | CHEMBL124370
TypeSmall organic molecule
Emp. Form.C25H23ClN4O3S
Mol. Mass.494.993
SMILESCc1cc(NC(=O)CCc2ccc3nc([nH]c3c2)-c2ccc(Cl)s2)ccc1N1CCOCC1=O