Reaction Details
TargetCoagulation factor X
LigandBDBM50149091
Substrate/Competitorn/a
Meas. Tech.ChEBML_48487
IC50 15±n/a nM
Citation Mederski, WWDorsch, DAnzali, SGleitz, JCezanne, BTsaklakidis, C Halothiophene benzimidazoles as P1 surrogates of inhibitors of blood coagulation factor Xa. Bioorg Med Chem Lett14:3763-9 (2004) 
 
Coagulation factor X
Name:Coagulation factor X
Type:Enzyme
Mol. Mass.:54726.60
Organism:Homo sapiens (Human)
Description:n/a
Residue:488
BDBM50149091
NameBDBM50149091
Synonyms:(S)-2-(3-Carbamimidoyl-phenylamino)-N-[4-(2-oxo-piperidin-1-yl)-phenyl]-2-phenyl-acetamide | CHEMBL341510
TypeSmall organic molecule
Emp. Form.C26H27N5O2
Mol. Mass.441.5249
SMILESNC(=N)c1cccc(N[C@H](C(=O)Nc2ccc(cc2)N2CCCCC2=O)c2ccccc2)c1