Reaction Details
TargetAdenosine receptor A3
LigandBDBM50117215
Substrate/Competitorn/a
Meas. Tech.ChEBML_31415
IC50 0.610000±n/a nM
Citation Okamura, TKurogi, YHashimoto, KSato, SNishikawa, HKiryu, KNagao, Y Structure-activity relationships of adenosine A3 receptor ligands: new potential therapy for the treatment of glaucoma. Bioorg Med Chem Lett14:3775-9 (2004) 
 
Adenosine receptor A3
Name:Adenosine receptor A3
Type:G Protein-Coupled Receptor (GPCR)
Mol. Mass.:36197.32
Organism:Homo sapiens (Human)
Description:P0DMS8
Residue:318
BDBM50117215
NameBDBM50117215
Synonyms:5-Butyl-8-(4-trifluoromethyl-phenyl)-3H-[1,2,4]triazolo[5,1-i]purine | CHEMBL123705
TypeSmall organic molecule
Emp. Form.C17H15F3N6
Mol. Mass.360.3364
SMILESCCCCc1nc2nc[nH]c2c2nc(nn12)-c1ccc(cc1)C(F)(F)F