Reaction Details
TargetMelatonin receptor type 1A
LigandBDBM50149167
Substrate/Competitorn/a
Meas. Tech.ChEBML_104948
Ki 0.760000±n/a nM
Citation Sun, LQChen, JBruce, MDeskus, JAEpperson, JRTakaki, KJohnson, GIben, LMahle, CDRyan, EXu, C Synthesis and structure-activity relationship of novel benzoxazole derivatives as melatonin receptor agonists. Bioorg Med Chem Lett14:3799-802 (2004) 
 
Melatonin receptor type 1A
Name:Melatonin receptor type 1A
Type:Enzyme
Mol. Mass.:39392.94
Organism:Homo sapiens (Human)
Description:P48039
Residue:350
BDBM50149167
NameBDBM50149167
Synonyms:CHEMBL330969 | N-{3-[2-(4-Phenyl-butyl)-benzooxazol-7-yl]-propyl}-propionamide
TypeSmall organic molecule
Emp. Form.C23H28N2O2
Mol. Mass.364.4806
SMILESCCC(=O)NCCCc1cccc2nc(CCCCc3ccccc3)oc12