Reaction Details
Target3-oxo-5-alpha-steroid 4-dehydrogenase 1
LigandBDBM50092485
Substrate/Competitorn/a
Meas. Tech.ChEMBL_205065 (CHEMBL810259)
IC50 5.8±n/a nM
Citation Occhiato, EGFerrali, AMenchi, GGuarna, ADanza, GComerci, AMancina, RSerio, MGarotta, GCavalli, ADe Vivo, MRecanatini, M Synthesis, biological activity, and three-dimensional quantitative structure-activity relationship model for a series of benzo[c]quinolizin-3-ones, nonsteroidal inhibitors of human steroid 5alpha-reductase 1. J Med Chem47:3546-60 (2004) 
 
3-oxo-5-alpha-steroid 4-dehydrogenase 1
Name:3-oxo-5-alpha-steroid 4-dehydrogenase 1
Type:Enzyme
Mol. Mass.:29472.80
Organism:Homo sapiens (Human)
Description:P18405
Residue:259
BDBM50092485
NameBDBM50092485
Synonyms:4-methyl-8-chloro-1,2,5,6-tetrahydro pyrido[1,2-a]quinolin-3-one CHEMBL118446
TypeSmall organic molecule
Emp. Form.C14H14ClNO
Mol. Mass.247.72
SMILESCC1=C2CCc3cc(Cl)ccc3N2CCC1=O