Reaction Details
TargetGABA-A receptor; alpha-5/beta-3/gamma-2
LigandBDBM50149426
Substrate/Competitorn/a
Meas. Tech.ChEMBL_70550 (CHEMBL680669)
Ki 0.91±n/a nM
Citation Street, LJSternfeld, FJelley, RAReeve, AJCarling, RWMoore, KWMcKernan, RMSohal, BCook, SPike, ADawson, GRBromidge, FAWafford, KASeabrook, GRThompson, SAMarshall, GPillai, GVCastro, JLAtack, JRMacLeod, AM Synthesis and biological evaluation of 3-heterocyclyl-7,8,9,10-tetrahydro-(7,10-ethano)-1,2,4-triazolo[3,4-a]phthalazines and analogues as subtype-selective inverse agonists for the GABA(A)alpha5 benzodiazepine binding site. J Med Chem47:3642-57 (2004) 
 
GABA-A receptor; alpha-5/beta-3/gamma-2
Name:GABA-A receptor; alpha-5/beta-3/gamma-2
Type:n/a
Mol. Mass.:n/a
Description:ASSAY_ID of ChEMBL is 2148177
Components:This complex has 3 components.
Component 1
Name:Gamma-aminobutyric acid receptor subunit gamma-2
Synonyms:GABA(A) receptor subunit gamma-2 GBRG2_HUMAN
Type:PROTEIN
Mol. Mass.:54172.74
Organism:Homo sapiens (Human)
Description:EBI_217
Residue:467
Component 2
Name:Gamma-aminobutyric acid receptor subunit beta-3
Synonyms:GABA A receptor alpha-4/beta-3/gamma-2 GABA-A receptor GBRB3_HUMAN | agonist GABA site
Type:PROTEIN
Mol. Mass.:54130.51
Organism:Homo sapiens (Human)
Description:ChEMBL_448071
Residue:473
Component 3
Name:Gamma-aminobutyric acid receptor subunit alpha-5
Synonyms:GABA receptor alpha-5 subunit GABRA5 Gamma-aminobutyric acid receptor subunit alpha-5 (GABA(A)) | Gamma-aminobutyric acid receptor subunit alpha-5 (GABAA)
Type:Enzyme
Mol. Mass.:52160.59
Organism:Homo sapiens (Human)
Description:P31644
Residue:462
BDBM50149426
NameBDBM50149426
Synonyms:3-isoquinolyl[6-(3-methyl-1,2,4-oxadiazol-5-yl)-4,5,7,8-tetraazatetracyclo[9.2.2.02,10.03,7]pentadeca-2(10),3,5,8-tetraen-9-yloxy]methane | CHEMBL331569
TypeSmall organic molecule
Emp. Form.C24H21N7O2
Mol. Mass.439.4692
SMILESCc1noc(n1)-c1nnc2c3C4CCC(CC4)c3c(OCc3cc4ccccc4cn3)nn12