Reaction Details
TargetGamma-aminobutyric acid receptor subunit alpha-3/beta-3/gamma-2
LigandBDBM50143105
Substrate/Competitorn/a
Meas. Tech.ChEMBL_70405 (CHEMBL680432)
Ki 0.33±n/a nM
Citation Street, LJSternfeld, FJelley, RAReeve, AJCarling, RWMoore, KWMcKernan, RMSohal, BCook, SPike, ADawson, GRBromidge, FAWafford, KASeabrook, GRThompson, SAMarshall, GPillai, GVCastro, JLAtack, JRMacLeod, AM Synthesis and biological evaluation of 3-heterocyclyl-7,8,9,10-tetrahydro-(7,10-ethano)-1,2,4-triazolo[3,4-a]phthalazines and analogues as subtype-selective inverse agonists for the GABA(A)alpha5 benzodiazepine binding site. J Med Chem47:3642-57 (2004) 
 
Gamma-aminobutyric acid receptor subunit alpha-3/beta-3/gamma-2
Name:Gamma-aminobutyric acid receptor subunit alpha-3/beta-3/gamma-2
Type:n/a
Mol. Mass.:n/a
Description:ASSAY_ID of EBI is 68410
Components:This complex has 3 components.
Component 1
Name:Gamma-aminobutyric acid receptor subunit gamma-2
Synonyms:GABA(A) receptor subunit gamma-2 GBRG2_HUMAN
Type:PROTEIN
Mol. Mass.:54172.74
Organism:Homo sapiens (Human)
Description:EBI_217
Residue:467
Component 2
Name:Gamma-aminobutyric acid receptor subunit beta-3
Synonyms:GABA A receptor alpha-4/beta-3/gamma-2 GABA-A receptor GBRB3_HUMAN | agonist GABA site
Type:PROTEIN
Mol. Mass.:54130.51
Organism:Homo sapiens (Human)
Description:ChEMBL_448071
Residue:473
Component 3
Name:Gamma-aminobutyric acid receptor subunit alpha-3
Synonyms:GABA A Alpha3Beta3Gamma2 GABA C GABA-A receptor GBRA3_HUMAN agonist GABA site
Type:Enzyme Catalytic Domain
Mol. Mass.:55175.47
Organism:Homo sapiens (Human)
Description:GABA A Alpha3Beta1Gamma2 0 HUMAN::P34903
Residue:492
BDBM50143105
NameBDBM50143105
Synonyms:6-(6-Methyl-pyridin-2-ylmethoxy)-3-phenyl-[1,2,4]triazolo[3,4-a]phthalazine | CHEMBL416659
TypeSmall organic molecule
Emp. Form.C22H17N5O
Mol. Mass.367.4033
SMILESCc1cccc(COc2nn3c(nnc3c3ccccc23)-c2ccccc2)n1