Reaction Details
TargetCorticotropin-releasing factor receptor 1
LigandBDBM50149657
Substrate/Competitorn/a
Meas. Tech.ChEMBL_302831 (CHEMBL838621)
Ki 1.7±n/a nM
Citation Huang, CQWilcoxen, KMGrigoriadis, DEMcCarthy, JRChen, C Design and synthesis of 3-(2-pyridyl)pyrazolo[1,5-a]pyrimidines as potent CRF1 receptor antagonists. Bioorg Med Chem Lett14:3943-7 (2004) 
 
Corticotropin-releasing factor receptor 1
Name:Corticotropin-releasing factor receptor 1
Type:Enzyme
Mol. Mass.:50744.31
Organism:Homo sapiens (Human)
Description:P34998
Residue:444
BDBM50149657
NameBDBM50149657
Synonyms:Benzyl-[3-(3-chloro-5-trifluoromethyl-pyridin-2-yl)-2,5-dimethyl-pyrazolo[1,5-a]pyrimidin-7-yl]-propyl-amine | CHEMBL361314
TypeSmall organic molecule
Emp. Form.C24H23ClF3N5
Mol. Mass.473.921
SMILESCCCN(Cc1ccccc1)c1cc(C)nc2c(c(C)nn12)-c1ncc(cc1Cl)C(F)(F)F