Reaction Details
TargetMuscarinic acetylcholine receptor M2
LigandBDBM50076091
Substrate/Competitorn/a
Meas. Tech.ChEMBL_302560 (CHEMBL875217)
Ki 4.3±n/a nM
Citation Chackalamannil, SDoller, DMcQuade, RRuperto, V Himbacine analogs as muscarinic receptor antagonists--effects of tether and heterocyclic variations. Bioorg Med Chem Lett14:3967-70 (2004) 
 
Muscarinic acetylcholine receptor M2
Name:Muscarinic acetylcholine receptor M2
Type:GPCR
Mol. Mass.:51730.61
Organism:Homo sapiens (Human)
Description:P08172
Residue:466
BDBM50076091
NameBDBM50076091
Synonyms:(3S,3aR,4R,4aS,8aR,9aS)-4-[2-((2R,6S)-1,6-Dimethyl-piperidin-2-yl)-ethyl]-3-methyl-decahydro-naphtho[2,3-c]furan-1-one | CHEMBL355854
TypeSmall organic molecule
Emp. Form.C22H37NO2
Mol. Mass.347.5347
SMILESC[C@@H]1OC(=O)[C@H]2C[C@H]3CCCC[C@@H]3[C@@H](CC[C@H]3CCC[C@H](C)N3C)[C@@H]12