Reaction Details
TargetLysophosphatidic acid receptor 3
LigandBDBM50149993
Substrate/Competitorn/a
Meas. Tech.ChEMBL_304755 (CHEMBL829353)
Ki 232±n/a nM
Citation Heasley, BHJarosz, RCarter, KMVan, SJLynch, KRMacdonald, TL A novel series of 2-pyridyl-containing compounds as lysophosphatidic acid receptor antagonists: development of a nonhydrolyzable LPA3 receptor-selective antagonist. Bioorg Med Chem Lett14:4069-74 (2004) 
 
Lysophosphatidic acid receptor 3
Name:Lysophosphatidic acid receptor 3
Type:Enzyme
Mol. Mass.:40149.72
Organism:Homo sapiens (Human)
Description:Q9UBY5
Residue:353
BDBM50149993
NameBDBM50149993
Synonyms:CHEMBL181612 | [4-(4-Benzyloxy-phenyl)-1-hydroxy-3-((Z)-(S)-octadec-9-enoylamino)-butyl]-phosphonic acid
TypeSmall organic molecule
Emp. Form.C35H54NO6P
Mol. Mass.615.7801
SMILESCCCCCCCC\C=C/CCCCCCCC(=O)N[C@H](CC(=O)P(O)(O)O)Cc1ccc(OCc2ccccc2)cc1