Reaction Details
TargetLysophosphatidic acid receptor 3
LigandBDBM50149996
Substrate/Competitorn/a
Meas. Tech.ChEMBL_304755 (CHEMBL829353)
Ki 39±n/a nM
Citation Heasley, BHJarosz, RCarter, KMVan, SJLynch, KRMacdonald, TL A novel series of 2-pyridyl-containing compounds as lysophosphatidic acid receptor antagonists: development of a nonhydrolyzable LPA3 receptor-selective antagonist. Bioorg Med Chem Lett14:4069-74 (2004) 
 
Lysophosphatidic acid receptor 3
Name:Lysophosphatidic acid receptor 3
Type:Enzyme
Mol. Mass.:40149.72
Organism:Homo sapiens (Human)
Description:Q9UBY5
Residue:353
BDBM50149996
NameBDBM50149996
Synonyms:CHEMBL183143 | Phosphoric acid mono-[3-[4-(4-ethoxy-pyridin-2-ylmethoxy)-phenyl]-2-((Z)-(R)-octadec-9-enoylamino)-propyl] ester
TypeSmall organic molecule
Emp. Form.C35H55N2O7P
Mol. Mass.646.7942
SMILESCCCCCCCC\C=C/CCCCCCCC(=O)N[C@@H](COP(O)(O)=O)Cc1ccc(OCc2cc(OCC)ccn2)cc1