Reaction Details
TargetSodium-dependent serotonin transporter
LigandBDBM50150100
Substrate/Competitorn/a
Meas. Tech.ChEMBL_201813 (CHEMBL805321)
Ki 20±n/a nM
Citation Mewshaw, REZhou, DZhou, PShi, XHornby, GSpangler, TScerni, RSmith, DSchechter, LEAndree, TH Studies toward the discovery of the next generation of antidepressants. 3. Dual 5-HT1A and serotonin transporter affinity within a class of N-aryloxyethylindolylalkylamines. J Med Chem47:3823-42 (2004) 
 
Sodium-dependent serotonin transporter
Name:Sodium-dependent serotonin transporter
Type:Multi-pass membrane protein
Mol. Mass.:70168.43
Organism:Rattus norvegicus (rat)
Description:P31652
Residue:630
BDBM50150100
NameBDBM50150100
Synonyms:CHEMBL340301 | [2-(1H-Indol-4-yloxy)-ethyl]-[3-(1H-indol-3-yl)-propyl]-amine
TypeSmall organic molecule
Emp. Form.C21H23N3O
Mol. Mass.333.4268
SMILESC(CNCCOc1cccc2[nH]ccc12)Cc1c[nH]c2ccccc12