Reaction Details
Target5-hydroxytryptamine receptor 1A
LigandBDBM50150096
Substrate/Competitorn/a
Meas. Tech.ChEMBL_686 (CHEMBL884528)
IC50 7.2±n/a nM
Citation Mewshaw, REZhou, DZhou, PShi, XHornby, GSpangler, TScerni, RSmith, DSchechter, LEAndree, TH Studies toward the discovery of the next generation of antidepressants. 3. Dual 5-HT1A and serotonin transporter affinity within a class of N-aryloxyethylindolylalkylamines. J Med Chem47:3823-42 (2004) 
 
5-hydroxytryptamine receptor 1A
Name:5-hydroxytryptamine receptor 1A
Type:n/a
Mol. Mass.:46122.49
Organism:Homo sapiens (Human)
Description:n/a
Residue:422
BDBM50150096
NameBDBM50150096
Synonyms:CHEMBL330827 | [2-(1H-Benzoimidazol-4-yloxy)-ethyl]-[3-(5-fluoro-1H-indol-3-yl)-propyl]-amine
TypeSmall organic molecule
Emp. Form.C20H21FN4O
Mol. Mass.352.4053
SMILESFc1ccc2[nH]cc(CCCNCCOc3cccc4nc[nH]c34)c2c1