Reaction Details
Target5-hydroxytryptamine receptor 1A
LigandBDBM50150107
Substrate/Competitorn/a
Meas. Tech.ChEMBL_611 (CHEMBL615161)
EC50 3±n/a nM
Citation Mewshaw, REZhou, DZhou, PShi, XHornby, GSpangler, TScerni, RSmith, DSchechter, LEAndree, TH Studies toward the discovery of the next generation of antidepressants. 3. Dual 5-HT1A and serotonin transporter affinity within a class of N-aryloxyethylindolylalkylamines. J Med Chem47:3823-42 (2004) 
 
5-hydroxytryptamine receptor 1A
Name:5-hydroxytryptamine receptor 1A
Type:n/a
Mol. Mass.:46122.49
Organism:Homo sapiens (Human)
Description:n/a
Residue:422
BDBM50150107
NameBDBM50150107
Synonyms:CHEMBL340705 | [3-(1H-Indol-3-yl)-propyl]-[2-(quinolin-8-yloxy)-ethyl]-amine
TypeSmall organic molecule
Emp. Form.C22H23N3O
Mol. Mass.345.4375
SMILESC(CNCCOc1cccc2cccnc12)Cc1c[nH]c2ccccc12