Reaction Details
TargetSodium-dependent serotonin transporter
LigandBDBM50150093
Substrate/Competitorn/a
Meas. Tech.ChEMBL_201813 (CHEMBL805321)
Ki 5±n/a nM
Citation Mewshaw, REZhou, DZhou, PShi, XHornby, GSpangler, TScerni, RSmith, DSchechter, LEAndree, TH Studies toward the discovery of the next generation of antidepressants. 3. Dual 5-HT1A and serotonin transporter affinity within a class of N-aryloxyethylindolylalkylamines. J Med Chem47:3823-42 (2004) 
 
Sodium-dependent serotonin transporter
Name:Sodium-dependent serotonin transporter
Type:Multi-pass membrane protein
Mol. Mass.:70168.43
Organism:Rattus norvegicus (rat)
Description:P31652
Residue:630
BDBM50150093
NameBDBM50150093
Synonyms:CHEMBL340873 | [2-(6-Fluoro-chroman-8-yloxy)-ethyl]-[2-(5-fluoro-1H-indol-3-yl)-ethyl]-amine
TypeSmall organic molecule
Emp. Form.C21H22F2N2O2
Mol. Mass.372.4084
SMILESFc1ccc2[nH]cc(CCNCCOc3cc(F)cc4CCCOc34)c2c1