Reaction Details
TargetProthrombin
LigandBDBM50150290
Substrate/Competitorn/a
Meas. Tech.ChEMBL_302338 (CHEMBL828922)
Ki 2.7±n/a nM
Citation Morrissette, MMStauffer, KJWilliams, PDLyle, TAVacca, JPKrueger, JALewis, SDLucas, BJWong, BKWhite, RBMiller-Stein, CLyle, EAWallace, AALeonard, YMWelsh, DCLynch, JJMcMasters, DR Low molecular weight thrombin inhibitors with excellent potency, metabolic stability, and oral bioavailability. Bioorg Med Chem Lett14:4161-4 (2004) 
 
Prothrombin
Name:Prothrombin
Type:Protein
Mol. Mass.:70029.57
Organism:Homo sapiens (Human)
Description:P00734
Residue:622
BDBM50150290
NameBDBM50150290
Synonyms:(S)-1-((S)-2-Hydroxy-2-phenyl-propionyl)-pyrrolidine-2-carboxylic acid 2-aminomethyl-5-chloro-benzylamide | CHEMBL362206
TypeSmall organic molecule
Emp. Form.C22H26ClN3O3
Mol. Mass.415.913
SMILESC[C@@](O)(C(=O)N1CCC[C@H]1C(=O)NCc1cc(Cl)ccc1CN)c1ccccc1