Reaction Details
TargetProthrombin
LigandBDBM50150291
Substrate/Competitorn/a
Meas. Tech.ChEMBL_302338 (CHEMBL828922)
Ki 3.7±n/a nM
Citation Morrissette, MMStauffer, KJWilliams, PDLyle, TAVacca, JPKrueger, JALewis, SDLucas, BJWong, BKWhite, RBMiller-Stein, CLyle, EAWallace, AALeonard, YMWelsh, DCLynch, JJMcMasters, DR Low molecular weight thrombin inhibitors with excellent potency, metabolic stability, and oral bioavailability. Bioorg Med Chem Lett14:4161-4 (2004) 
 
Prothrombin
Name:Prothrombin
Type:Protein
Mol. Mass.:70029.57
Organism:Homo sapiens (Human)
Description:P00734
Residue:622
BDBM50150291
NameBDBM50150291
Synonyms:(S)-1-((R)-3-Cyclopropyl-2-hydroxy-3-methyl-butyryl)-azetidine-2-carboxylic acid 2-aminomethyl-5-chloro-benzylamide | CHEMBL182124
TypeSmall organic molecule
Emp. Form.C20H28ClN3O3
Mol. Mass.393.908
SMILESCC(C)([C@@H](O)C(=O)N1CC[C@H]1C(=O)NCc1cc(Cl)ccc1CN)C1CC1