Reaction Details
TargetProthrombin
LigandBDBM50150296
Substrate/Competitorn/a
Meas. Tech.ChEMBL_302338 (CHEMBL828922)
Ki 5.6±n/a nM
Citation Morrissette, MMStauffer, KJWilliams, PDLyle, TAVacca, JPKrueger, JALewis, SDLucas, BJWong, BKWhite, RBMiller-Stein, CLyle, EAWallace, AALeonard, YMWelsh, DCLynch, JJMcMasters, DR Low molecular weight thrombin inhibitors with excellent potency, metabolic stability, and oral bioavailability. Bioorg Med Chem Lett14:4161-4 (2004) 
 
Prothrombin
Name:Prothrombin
Type:Protein
Mol. Mass.:70029.57
Organism:Homo sapiens (Human)
Description:P00734
Residue:622
BDBM50150296
NameBDBM50150296
Synonyms:(S)-1-((R)-2-Hydroxy-3-methyl-butyryl)-pyrrolidine-2-carboxylic acid 2-aminomethyl-5-chloro-benzylamide | CHEMBL360269
TypeSmall organic molecule
Emp. Form.C18H26ClN3O3
Mol. Mass.367.87
SMILESCC(C)[C@@H](O)C(=O)N1CCC[C@H]1C(=O)NCc1cc(Cl)ccc1CN