Reaction Details
TargetProthrombin
LigandBDBM50150299
Substrate/Competitorn/a
Meas. Tech.ChEMBL_302338 (CHEMBL828922)
Ki 0.9±n/a nM
Citation Morrissette, MMStauffer, KJWilliams, PDLyle, TAVacca, JPKrueger, JALewis, SDLucas, BJWong, BKWhite, RBMiller-Stein, CLyle, EAWallace, AALeonard, YMWelsh, DCLynch, JJMcMasters, DR Low molecular weight thrombin inhibitors with excellent potency, metabolic stability, and oral bioavailability. Bioorg Med Chem Lett14:4161-4 (2004) 
 
Prothrombin
Name:Prothrombin
Type:Protein
Mol. Mass.:70029.57
Organism:Homo sapiens (Human)
Description:P00734
Residue:622
BDBM50150299
NameBDBM50150299
Synonyms:(S)-1-((R)-2-Hydroxy-2-phenyl-acetyl)-pyrrolidine-2-carboxylic acid 2-aminomethyl-5-chloro-benzylamide | CHEMBL184580
TypeSmall organic molecule
Emp. Form.C21H24ClN3O3
Mol. Mass.401.887
SMILESNCc1ccc(Cl)cc1CNC(=O)[C@@H]1CCCN1C(=O)[C@H](O)c1ccccc1