Reaction Details
TargetBromodomain-containing protein 3
LigandBDBM50582040
Substrate/Competitorn/a
Meas. Tech.ChEMBL_2152766 (CHEMBL5037313)
Kd 20±n/a nM
Citation Cui, HCarlson, ASSchleiff, MADivakaran, AJohnson, JABuchholz, CRZahid, HVail, NRShi, KAihara, HHarki, DAMiller, GPTopczewski, JJPomerantz, WCK 4-Methyl-1,2,3-Triazoles as  J Med Chem64:10497-10511 (2021) 
 
Bromodomain-containing protein 3
Name:Bromodomain-containing protein 3
Type:Protein
Mol. Mass.:79571.81
Organism:Homo sapiens (Human)
Description:Q15059
Residue:726
BDBM50582040
NameBDBM50582040
Synonyms:CHEMBL5083660
TypeSmall organic molecule
Emp. Form.C25H34N6O
Mol. Mass.434.5771
SMILESCN(C)CCN1CCC(CC1)n1nnc(C)c1-c1cccc(Oc2cc(C)cc(C)c2)n1