Reaction Details
TargetMitogen-activated protein kinase 1
LigandBDBM16591
Substrate/Competitorn/a
Meas. Tech.ChEMBL_306511 (CHEMBL828116)
IC50 824±n/a nM
Citation Sharma, VTepe, JJ Potent inhibition of checkpoint kinase activity by a hymenialdisine-derived indoloazepine. Bioorg Med Chem Lett14:4319-21 (2004) 
 
Mitogen-activated protein kinase 1
Name:Mitogen-activated protein kinase 1
Type:Ser/Thr Protein Kinase
Mol. Mass.:41392.76
Organism:Homo sapiens (Human)
Description:P28482
Residue:360
BDBM16591
NameBDBM16591
Synonyms:(4Z)-4-(2-amino-5-oxo-3,5-dihydro-4H-imidazol-4-ylidene)-4,5,6,7-tetrahydropyrrolo[2,3-c]azepin-8(1H)-one B722657K110 Debromohymenialdisine (DBH) NSC607174
TypeSmall organic molecule
Emp. Form.C11H11N5O2
Mol. Mass.245.2373
SMILESNC1=NC(=O)C(N1)=C1CCNC(=O)c2[nH]ccc12