Reaction Details
TargetSerine/threonine-protein kinase Chk2
LigandBDBM7491
Substrate/Competitorn/a
Meas. Tech.ChEMBL_306067 (CHEMBL833022)
IC50 42±n/a nM
Citation Sharma, VTepe, JJ Potent inhibition of checkpoint kinase activity by a hymenialdisine-derived indoloazepine. Bioorg Med Chem Lett14:4319-21 (2004) 
 
Serine/threonine-protein kinase Chk2
Name:Serine/threonine-protein kinase Chk2
Type:Protein
Mol. Mass.:60908.59
Organism:Homo sapiens (Human)
Description:O96017
Residue:543
BDBM7491
NameBDBM7491
Synonyms:(4Z)-4-(2-amino-5-oxo-3,5-dihydro-4H-imidazol-4-ylidene)-2-bromo-4,5,6,7-tetrahydropyrrolo[2,3-c]azepin-8(1H)-one (Z)-hymenialdisine 4-(2-Amino-4-oxo-2-imidazolidin-5-ylidene)-2-bromo-4,5,6,7-tetrahydropyrrolo[2,3-c]azepin-8-one 4-(2-amino-4-oxo-1H-imidazol-5(4H)-ylidene)-2-bromo-4,5,6,7-tetrahydropyrrolo[2,3-c]azepin-8(1H)-one 4-[2-Amino-5-oxo-3,5-dihydro-imidazol-(4Z)-ylidene]-2-bromo-4,5,6,7-tetrahydro-1H-pyrrolo[2,3-c]azepin-8-one Hymenialdisine | Hymenialdisine, 1
TypeSmall organic molecule
Emp. Form.C11H10BrN5O2
Mol. Mass.324.133
SMILESNC1=NC(=O)C(N1)=C1CCNC(=O)c2[nH]c(Br)cc12