Reaction Details
TargetPeroxisome proliferator-activated receptor alpha
LigandBDBM50124389
Substrate/Competitorn/a
Meas. Tech.ChEMBL_304406 (CHEMBL831811)
EC50 4±n/a nM
Citation Henke, BR Peroxisome proliferator-activated receptor alpha/gamma dual agonists for the treatment of type 2 diabetes. J Med Chem47:4118-27 (2004) 
 
Peroxisome proliferator-activated receptor alpha
Name:Peroxisome proliferator-activated receptor alpha
Type:Enzyme
Mol. Mass.:52222.08
Organism:Homo sapiens (Human)
Description:Q07869
Residue:468
BDBM50124389
NameBDBM50124389
Synonyms:2,2-Dimethyl-3-{4-[4-(3-phenyl-7-propyl-benzo[d]isoxazol-6-yloxy)-butoxy]-phenyl}-propionic acid | CHEMBL173159
TypeSmall organic molecule
Emp. Form.C31H35NO5
Mol. Mass.501.6133
SMILESCCCc1c(OCCCCOc2ccc(CC(C)(C)C(O)=O)cc2)ccc2c(noc12)-c1ccccc1