Reaction Details
TargetTyrosine-protein phosphatase non-receptor type 1
LigandBDBM50151008
Substrate/Competitorn/a
Meas. Tech.ChEMBL_302800 (CHEMBL838509)
pH5.5±n/a
Ki 18±n/a nM
Commentsextracted
Citation Hooft van Huijsduijnen, RSauer, WHBombrun, ASwinnen, D Prospects for inhibitors of protein tyrosine phosphatase 1B as antidiabetic drugs. J Med Chem47:4142-6 (2004) 
 
Tyrosine-protein phosphatase non-receptor type 1
Name:Tyrosine-protein phosphatase non-receptor type 1
Type:Protein phosphatase
Mol. Mass.:49963.76
Organism:Homo sapiens (Human)
Description:Human recombinant GST-fusion PTP1B (1-435).
Residue:435
BDBM50151008
NameBDBM50151008
Synonyms:(7S)-2-[(carboxycarbonyl)amino]-7-({[(5-fluoro-1H-indol-2-yl)carbonyl]amino}methyl)-4,5,6,7-tetrahydrothieno[2,3-c]pyridine-3-carboxylic acid | CHEMBL185891
TypeSmall organic molecule
Emp. Form.C20H17FN4O6S
Mol. Mass.460.436
SMILESOC(=O)C(=O)Nc1sc2C(CNC(=O)c3cc4cc(F)ccc4[nH]3)NCCc2c1C(O)=O