Reaction Details
TargetBifunctional dihydrofolate reductase-thymidylate synthase
LigandBDBM18779
Substrate/Competitorn/a
Meas. Tech.ChEMBL_302861 (CHEMBL828776)
Ki 1.10±n/a nM
Citation Parenti, MDPacchioni, SFerrari, AMRastelli, G Three-dimensional quantitative structure-activity relationship analysis of a set of Plasmodium falciparum dihydrofolate reductase inhibitors using a pharmacophore generation approach. J Med Chem47:4258-67 (2004) 
 
Bifunctional dihydrofolate reductase-thymidylate synthase
Name:Bifunctional dihydrofolate reductase-thymidylate synthase
Type:Enzyme
Mol. Mass.:71822.51
Organism:Plasmodium falciparum (isolate K1 / Thailand)
Description:The mutant clone was prepared by cassette mutagenesis using wildtype pfDHFR as a template, and expressed in E. coli.
Residue:608
BDBM18779
NameBDBM18779
Synonyms:6-ethyl-5-(4-methylphenyl)pyrimidine-2,4-diamine P17
TypeSmall organic molecule
Emp. Form.C13H16N4
Mol. Mass.228.2929
SMILESCCc1nc(N)nc(N)c1-c1ccc(C)cc1