Reaction Details
TargetBifunctional dihydrofolate reductase-thymidylate synthase
LigandBDBM50110759
Substrate/Competitorn/a
Meas. Tech.ChEMBL_302861 (CHEMBL828776)
Ki 10.00±n/a nM
Citation Parenti, MDPacchioni, SFerrari, AMRastelli, G Three-dimensional quantitative structure-activity relationship analysis of a set of Plasmodium falciparum dihydrofolate reductase inhibitors using a pharmacophore generation approach. J Med Chem47:4258-67 (2004) 
 
Bifunctional dihydrofolate reductase-thymidylate synthase
Name:Bifunctional dihydrofolate reductase-thymidylate synthase
Type:Enzyme
Mol. Mass.:71822.51
Organism:Plasmodium falciparum (isolate K1 / Thailand)
Description:The mutant clone was prepared by cassette mutagenesis using wildtype pfDHFR as a template, and expressed in E. coli.
Residue:608
BDBM50110759
NameBDBM50110759
Synonyms:4-(2,6-Diamino-5-phenyl-pyrimidin-4-yl)-butyric acid methyl ester | CHEMBL21407
TypeSmall organic molecule
Emp. Form.C15H18N4O2
Mol. Mass.286.329
SMILESCOC(=O)CCCc1nc(N)nc(N)c1-c1ccccc1