Reaction Details
TargetBifunctional dihydrofolate reductase-thymidylate synthase
LigandBDBM50090069
Substrate/Competitorn/a
Meas. Tech.ChEMBL_302861 (CHEMBL828776)
Ki 1.1±n/a nM
Citation Parenti, MDPacchioni, SFerrari, AMRastelli, G Three-dimensional quantitative structure-activity relationship analysis of a set of Plasmodium falciparum dihydrofolate reductase inhibitors using a pharmacophore generation approach. J Med Chem47:4258-67 (2004) 
 
Bifunctional dihydrofolate reductase-thymidylate synthase
Name:Bifunctional dihydrofolate reductase-thymidylate synthase
Type:Enzyme
Mol. Mass.:71822.51
Organism:Plasmodium falciparum (isolate K1 / Thailand)
Description:The mutant clone was prepared by cassette mutagenesis using wildtype pfDHFR as a template, and expressed in E. coli.
Residue:608
BDBM50090069
NameBDBM50090069
Synonyms:1-(3,4-Dichloro-phenyl)-6,6-dimethyl-1,6-dihydro-[1,3,5]triazine-2,4-diamine | CHEMBL92583
TypeSmall organic molecule
Emp. Form.C11H13Cl2N5
Mol. Mass.286.16
SMILESCC1(C)N=C(N)N=C(N)N1c1ccc(Cl)c(Cl)c1