Reaction Details
TargetMetabotropic glutamate receptor 2
LigandBDBM50151473
Substrate/Competitorn/a
Meas. Tech.ChEMBL_306006 (CHEMBL832679)
IC50 22.7±n/a nM
Citation Nakazato, ASakagami, KYasuhara, AOhta, HYoshikawa, RItoh, MNakamura, MChaki, S Synthesis, in vitro pharmacology, structure-activity relationships, and pharmacokinetics of 3-alkoxy-2-amino-6-fluorobicyclo[3.1.0]hexane-2,6-dicarboxylic acid derivatives as potent and selective group II metabotropic glutamate receptor antagonists. J Med Chem47:4570-87 (2004) 
 
Metabotropic glutamate receptor 2
Name:Metabotropic glutamate receptor 2
Type:Enzyme
Mol. Mass.:95584.88
Organism:Homo sapiens (Human)
Description:Q14416
Residue:872
BDBM50151473
NameBDBM50151473
Synonyms:(1R,2R,3R,5R,6R)-2-Amino-6-fluoro-3-(naphthalen-2-ylmethoxy)-bicyclo[3.1.0]hexane-2,6-dicarboxylic acid | CHEMBL185210
TypeSmall organic molecule
Emp. Form.C19H18FNO5
Mol. Mass.359.3483
SMILESN[C@@]1([C@H]2[C@@H](C[C@H]1OCc1ccc3ccccc3c1)[C@]2(F)C(O)=O)C(O)=O