Reaction Details
TargetMetabotropic glutamate receptor 3
LigandBDBM50151447
Substrate/Competitorn/a
Meas. Tech.ChEMBL_303461 (CHEMBL839721)
Ki 4.77±n/a nM
Citation Nakazato, ASakagami, KYasuhara, AOhta, HYoshikawa, RItoh, MNakamura, MChaki, S Synthesis, in vitro pharmacology, structure-activity relationships, and pharmacokinetics of 3-alkoxy-2-amino-6-fluorobicyclo[3.1.0]hexane-2,6-dicarboxylic acid derivatives as potent and selective group II metabotropic glutamate receptor antagonists. J Med Chem47:4570-87 (2004) 
 
Metabotropic glutamate receptor 3
Name:Metabotropic glutamate receptor 3
Type:Protein
Mol. Mass.:98971.84
Organism:Rattus norvegicus (Rat)
Description:P31422
Residue:879
BDBM50151447
NameBDBM50151447
Synonyms:(1R,2R,3R,5R,6R)-2-Amino-3-(4-chloro-benzyloxy)-6-fluoro-bicyclo[3.1.0]hexane-2,6-dicarboxylic acid | CHEMBL189814
TypeSmall organic molecule
Emp. Form.C15H15ClFNO5
Mol. Mass.343.735
SMILESN[C@@]1([C@H]2[C@@H](C[C@H]1OCc1ccc(Cl)cc1)[C@]2(F)C(O)=O)C(O)=O