Reaction Details
TargetPlatelet-derived growth factor receptor beta
LigandBDBM50152365
Substrate/Competitorn/a
Meas. Tech.ChEMBL_306777 (CHEMBL831532)
IC50 310±n/a nM
Citation Heath, JAMehrotra, MMChi, SYu, JCHutchaleelaha, AHollenbach, SJGiese, NAScarborough, RMPandey, A Identification of 4-piperazin-1-yl-quinazoline template based aryl and benzyl thioureas as potent, selective, and orally bioavailable inhibitors of platelet-derived growth factor (PDGF) receptor. Bioorg Med Chem Lett14:4867-72 (2004) 
 
Platelet-derived growth factor receptor beta
Name:Platelet-derived growth factor receptor beta
Type:Enzyme
Mol. Mass.:123922.25
Organism:Homo sapiens (Human)
Description:P09619
Residue:1106
BDBM50152365
NameBDBM50152365
Synonyms:4-[6-Methoxy-7-(2-pyrrolidin-1-yl-ethoxy)-quinazolin-4-yl]-piperazine-1-carbothioic acid (furan-2-ylmethyl)-amide | CHEMBL185597
TypeSmall organic molecule
Emp. Form.C25H32N6O3S
Mol. Mass.496.625
SMILESCOc1cc2c(ncnc2cc1OCCN1CCCC1)N1CCN(CC1)C(=S)NCc1ccco1