Reaction Details
TargetPlatelet-derived growth factor receptor beta
LigandBDBM50152381
Substrate/Competitorn/a
Meas. Tech.ChEMBL_306777 (CHEMBL831532)
IC50 260±n/a nM
Citation Heath, JAMehrotra, MMChi, SYu, JCHutchaleelaha, AHollenbach, SJGiese, NAScarborough, RMPandey, A Identification of 4-piperazin-1-yl-quinazoline template based aryl and benzyl thioureas as potent, selective, and orally bioavailable inhibitors of platelet-derived growth factor (PDGF) receptor. Bioorg Med Chem Lett14:4867-72 (2004) 
 
Platelet-derived growth factor receptor beta
Name:Platelet-derived growth factor receptor beta
Type:Enzyme
Mol. Mass.:123922.25
Organism:Homo sapiens (Human)
Description:P09619
Residue:1106
BDBM50152381
NameBDBM50152381
Synonyms:4-[6-Methoxy-7-(2-morpholin-4-yl-ethoxy)-quinazolin-4-yl]-piperazine-1-carbothioic acid (benzo[1,3]dioxol-5-ylmethyl)-amide | CHEMBL187960
TypeSmall organic molecule
Emp. Form.C28H34N6O5S
Mol. Mass.566.672
SMILESCOc1cc2c(ncnc2cc1OCCN1CCOCC1)N1CCN(CC1)C(=S)NCc1ccc2OCOc2c1