Reaction Details
TargetPlatelet-derived growth factor receptor beta
LigandBDBM50152380
Substrate/Competitorn/a
Meas. Tech.ChEMBL_306777 (CHEMBL831532)
IC50 400±n/a nM
Citation Heath, JAMehrotra, MMChi, SYu, JCHutchaleelaha, AHollenbach, SJGiese, NAScarborough, RMPandey, A Identification of 4-piperazin-1-yl-quinazoline template based aryl and benzyl thioureas as potent, selective, and orally bioavailable inhibitors of platelet-derived growth factor (PDGF) receptor. Bioorg Med Chem Lett14:4867-72 (2004) 
 
Platelet-derived growth factor receptor beta
Name:Platelet-derived growth factor receptor beta
Type:Enzyme
Mol. Mass.:123922.25
Organism:Homo sapiens (Human)
Description:P09619
Residue:1106
BDBM50152380
NameBDBM50152380
Synonyms:4-[6-Methoxy-7-(2-piperidin-1-yl-ethoxy)-quinazolin-4-yl]-piperazine-1-carbothioic acid pyridin-4-ylamide | CHEMBL435098
TypeSmall organic molecule
Emp. Form.C26H33N7O2S
Mol. Mass.507.651
SMILESCOc1cc2c(ncnc2cc1OCCN1CCCCC1)N1CCN(CC1)C(=S)Nc1ccncc1