Reaction Details
TargetPlatelet-derived growth factor receptor beta
LigandBDBM50152369
Substrate/Competitorn/a
Meas. Tech.ChEMBL_306481 (CHEMBL874567)
IC50 150±n/a nM
Citation Heath, JAMehrotra, MMChi, SYu, JCHutchaleelaha, AHollenbach, SJGiese, NAScarborough, RMPandey, A Identification of 4-piperazin-1-yl-quinazoline template based aryl and benzyl thioureas as potent, selective, and orally bioavailable inhibitors of platelet-derived growth factor (PDGF) receptor. Bioorg Med Chem Lett14:4867-72 (2004) 
 
Platelet-derived growth factor receptor beta
Name:Platelet-derived growth factor receptor beta
Type:Enzyme
Mol. Mass.:123922.25
Organism:Homo sapiens (Human)
Description:P09619
Residue:1106
BDBM50152369
NameBDBM50152369
Synonyms:4-[6-Methoxy-7-(2-piperidin-1-yl-ethoxy)-quinazolin-4-yl]-piperazine-1-carbothioic acid (6-trifluoromethyl-pyridin-3-ylmethyl)-amide | CHEMBL184244
TypeSmall organic molecule
Emp. Form.C28H34F3N7O2S
Mol. Mass.589.675
SMILESCOc1cc2c(ncnc2cc1OCCN1CCCCC1)N1CCN(CC1)C(=S)NCc1ccc(nc1)C(F)(F)F