Reaction Details
TargetPlatelet-derived growth factor receptor beta
LigandBDBM50152377
Substrate/Competitorn/a
Meas. Tech.ChEMBL_306777 (CHEMBL831532)
IC50 590.0±n/a nM
Citation Heath, JAMehrotra, MMChi, SYu, JCHutchaleelaha, AHollenbach, SJGiese, NAScarborough, RMPandey, A Identification of 4-piperazin-1-yl-quinazoline template based aryl and benzyl thioureas as potent, selective, and orally bioavailable inhibitors of platelet-derived growth factor (PDGF) receptor. Bioorg Med Chem Lett14:4867-72 (2004) 
 
Platelet-derived growth factor receptor beta
Name:Platelet-derived growth factor receptor beta
Type:Enzyme
Mol. Mass.:123922.25
Organism:Homo sapiens (Human)
Description:P09619
Residue:1106
BDBM50152377
NameBDBM50152377
Synonyms:4-[4-(N-Substituted-thio-carbamoyl)-1-piperazinyl]-6-methoxy-7-alkoxyamino-quinazoline derivative | CHEMBL186850
TypeSmall organic molecule
Emp. Form.C31H38N8O4
Mol. Mass.586.6846
SMILESCOc1cc2c(ncnc2cc1OCCCN1CCCCC1)N1CCN(CC1)C(NCc1ccc2OCOc2c1)=NC#N