Reaction Details
TargetHistone deacetylase 6
LigandBDBM22449
Substrate/Competitorn/a
Meas. Tech.ChEMBL_2157812 (CHEMBL5042562)
IC50 1600±n/a nM
Citation Olaoye, OOWatson, PRNawar, NGeletu, MSedighi, ABukhari, SRaouf, YSManaswiyoungkul, PErdogan, FAbdeldayem, ACabral, ADHassan, MMToutah, KShouksmith, AEGawel, JMIsraelian, JRadu, TBKachhiyapatel, Nde Araujo, EDChristianson, DWGunning, PT Unique Molecular Interaction with the Histone Deacetylase 6 Catalytic Tunnel: Crystallographic and Biological Characterization of a Model Chemotype. J Med Chem64:2691-2704 (2021) 
 
Histone deacetylase 6
Name:Histone deacetylase 6
Type:Chromatin regulator; hydrolase; repressor
Mol. Mass.:131381.51
Organism:Homo sapiens (Human)
Description:Q9UBN7
Residue:1215
BDBM22449
NameBDBM22449
Synonyms:CHEMBL356769 Tubacin | US9249087, Tubastatin A
TypeSmall organic molecule
Emp. Form.C41H43N3O7S
Mol. Mass.721.861
SMILESOCc1ccc(cc1)[C@@H]1C[C@H](CSc2nc(c(o2)-c2ccccc2)-c2ccccc2)O[C@@H](O1)c1ccc(NC(=O)CCCCCCC(=O)NO)cc1