Reaction Details
TargetFatty acid-binding protein, heart
LigandBDBM50152878
Substrate/Competitorn/a
Meas. Tech.ChEMBL_306241 (CHEMBL830338)
IC50>100000±n/a nM
Citation Ringom, RAxen, EUppenberg, JLundbäck, TRondahl, LBarf, T Substituted benzylamino-6-(trifluoromethyl)pyrimidin-4(1H)-ones: a novel class of selective human A-FABP inhibitors. Bioorg Med Chem Lett14:4449-52 (2004) 
 
Fatty acid-binding protein, heart
Name:Fatty acid-binding protein, heart
Type:PROTEIN
Mol. Mass.:14858.36
Organism:Homo sapiens (Human)
Description:ChEMBL_1463784
Residue:133
BDBM50152878
NameBDBM50152878
Synonyms:2-(Benzyl-methyl-amino)-6-trifluoromethyl-pyrimidin-4-ol | CHEMBL185326
TypeSmall organic molecule
Emp. Form.C13H12F3N3O
Mol. Mass.283.2491
SMILESCN(Cc1ccccc1)c1nc(cc(=O)[nH]1)C(F)(F)F