Reaction Details
TargetFatty acid-binding protein, heart
LigandBDBM50152879
Substrate/Competitorn/a
Meas. Tech.ChEMBL_306241 (CHEMBL830338)
IC50>100000±n/a nM
Citation Ringom, RAxen, EUppenberg, JLundbäck, TRondahl, LBarf, T Substituted benzylamino-6-(trifluoromethyl)pyrimidin-4(1H)-ones: a novel class of selective human A-FABP inhibitors. Bioorg Med Chem Lett14:4449-52 (2004) 
 
Fatty acid-binding protein, heart
Name:Fatty acid-binding protein, heart
Type:PROTEIN
Mol. Mass.:14858.36
Organism:Homo sapiens (Human)
Description:ChEMBL_1463784
Residue:133
BDBM50152879
NameBDBM50152879
Synonyms:2-(4-Methoxy-benzylamino)-6-trifluoromethyl-pyrimidin-4-ol | CHEMBL182801
TypeSmall organic molecule
Emp. Form.C13H12F3N3O2
Mol. Mass.299.2485
SMILESCOc1ccc(CNc2nc(cc(=O)[nH]2)C(F)(F)F)cc1