Reaction Details
TargetFatty acid-binding protein, heart
LigandBDBM50152891
Substrate/Competitorn/a
Meas. Tech.ChEMBL_306241 (CHEMBL830338)
IC50>100000±n/a nM
Citation Ringom, RAxen, EUppenberg, JLundbäck, TRondahl, LBarf, T Substituted benzylamino-6-(trifluoromethyl)pyrimidin-4(1H)-ones: a novel class of selective human A-FABP inhibitors. Bioorg Med Chem Lett14:4449-52 (2004) 
 
Fatty acid-binding protein, heart
Name:Fatty acid-binding protein, heart
Type:PROTEIN
Mol. Mass.:14858.36
Organism:Homo sapiens (Human)
Description:ChEMBL_1463784
Residue:133
BDBM50152891
NameBDBM50152891
Synonyms:2-(4-Chloro-benzylamino)-6-trifluoromethyl-pyrimidin-4-ol | CHEMBL184852
TypeSmall organic molecule
Emp. Form.C12H9ClF3N3O
Mol. Mass.303.668
SMILESFC(F)(F)c1cc(=O)[nH]c(NCc2ccc(Cl)cc2)n1